{"text_format":"1","workbook":"xlsx","n_sheets":14,"sheets":["Introduzione","Istruzioni","1. Idea imprenditoriale","2. Tenore di vita","3. Piano di investimento","4. Pianificazione del fatturato","5. Costi del personale","6. Conto economico annuo","7. Conto economico mensile","7. Piano di finanziamento","9. Piano d'ammortamento","8. Riepilogo ammortamento","To-do-list","Glossario"],"not_rendered":{"charts":4,"images":1,"macros":1,"external_links":2,"defined_names":40,"comments":9,"pivot_tables":0},"unopened":[],"bounds":{"document_bytes":16777216,"sheet_cells":100000,"rows_first":2000,"rows_last":500,"rows_between":2000,"halvings":0,"cell_chars":16384,"cell_head_chars":4096},"cells_cut":0,"cells_raw":0,"read":"whole","date_system":"1900"}

{"sheet":"Introduzione","index":0,"n_rows":40,"n_cols":1,"rows_kept":40,"cut":false,"hidden":false,"merged":[]}
[]
[]
[]
[]
[]
[]
{"$rows_left_out":35}
{"sheet":"Istruzioni","index":1,"n_rows":61,"n_cols":2,"rows_kept":61,"cut":false,"hidden":false,"merged":[[60,1,60,10],[16,1,16,10],[13,1,13,10],[52,1,52,10],[53,1,53,10],[54,1,54,10],[55,1,55,10],[56,1,56,10],[57,1,57,10],[46,0,46,10],[47,1,47,10],[50,1,50,10],[51,1,51,10],[40,1,40,10],[41,1,41,10],[42,1,42,10],[43,1,43,10],[44,1,44,10],[45,1,45,10],[39,0,39,10],[22,1,22,10],[23,1,23,10],[24,1,24,10],[25,1,25,10],[33,0,33,10],[35,1,35,10],[37,1,37,10],[31,1,31,10],[29,1,29,10],[28,1,28,10],[2,0,2,10],[4,0,4,10],[7,1,7,10],[8,1,8,10],[9,1,9,10],[10,1,10,10],[18,0,18,10],[19,1,19,10],[21,0,21,10],[27,0,27,10]]}
[]
[]
[]
[]
["Avviso importante:\nIl business plan è stato concepito in particolare per aspiranti imprenditori ed imprenditrici. Lo strumento permette di elaborare calcoli semplificati destinati a favorirne la comprensione e la facilità di redazione. A causa della complessità della materia, non è stato possibile tenere conto di tutti gli aspetti legali, fiscali e contabili. Nonostante ciò, il modello di business plan proposto è un aiuto prezioso per l’esame della redditività economica della propria idea imprenditoriale e può servire inoltre da strumento di controllo dell’attività imprenditoriale anche in avvenire. \n"]
[]
{"$rows_left_out":56}
{"sheet":"1. Idea imprenditoriale","index":2,"n_rows":56,"n_cols":12,"rows_kept":56,"cut":false,"hidden":false,"merged":[[40,0,40,3],[31,1,31,3],[25,0,25,3],[26,1,26,3],[27,1,27,3],[28,1,28,3],[39,1,39,3],[36,1,36,3],[37,1,37,3],[38,1,38,3],[35,0,35,3],[49,1,49,3],[56,1,56,3],[47,0,47,3],[48,1,48,3],[51,1,51,3],[54,1,54,3],[55,0,55,3],[50,1,50,3],[52,1,52,3],[53,1,53,3],[4,1,4,3],[7,0,7,3],[0,0,0,3],[1,1,1,3],[2,1,2,3],[3,1,3,3],[5,1,5,3],[6,1,6,3],[22,1,22,3],[8,1,8,3],[32,1,32,3],[33,1,33,3],[34,1,34,3],[9,1,9,3],[23,1,23,3],[24,1,24,3],[29,1,29,3],[30,0,30,3],[10,1,10,3],[18,1,18,3],[11,0,11,3],[21,1,21,3],[20,0,20,3]]}
["Idea imprenditoriale"]
["La Sua idea imprenditoriale"]
["Nome dell'impresa",null,null,null,null,null,null,null,null,null,1,{"$f":"IF(K3=1,1,IF(K3>=4,2,3))","v":1}]
["Forma giuridica "]
["Attività / settore"]
["Sede "]
{"$rows_left_out":51}
{"sheet":"2. Tenore di vita","index":3,"n_rows":24,"n_cols":4,"rows_kept":24,"cut":false,"hidden":false,"merged":[[23,2,23,3],[0,0,0,3],[18,2,18,3],[19,2,19,3],[20,2,20,3],[21,2,21,3],[22,2,22,3]]}
["Il sostentamento della vita / reddito netto"]
[null,"mensile","numero mensilità","annuale"]
["Reddito netto da lavoro (prima dell'attività imprenditoriale)",null,null,{"$f":"B3*C3","v":0}]
["Entrate secondarie (affitti, interessi, etc.)",null,null,{"$f":"B4*C4","v":0}]
[null,null,null,0]
["Totale entrate",null,null,{"$f":"SUM(D3:D5)","v":0}]
{"$rows_left_out":19}
{"sheet":"3. Piano di investimento","index":4,"n_rows":54,"n_cols":57,"rows_kept":54,"cut":false,"hidden":false,"merged":[[1,40,1,44],[1,46,1,50],[1,52,1,56],[0,0,0,13],[26,0,26,1],[1,0,1,1],[23,0,23,1],[1,28,1,32],[1,34,1,38]]}
["Piano di investimento"]
["a) Immobilizzazione materiali:",null,"anno 1","anno 2","anno 3","anno 4","anno 5","utilità in anni","quota di ammorta-mento ","ammor-tamento anno  1","ammor-tamento anno 2","ammor-tamento anno 3","ammor-tamento anno 4","ammor-tamento anno 5",null,null,"Jahr 1","Jahr 2","Jahr 3","Jahr 4","Jahr 5","Ø",null,null,null,null,null,null,"Berechnung Abschreibung für die Investition des 1. Jahres",null,null,null,null,null,"Berechnung Abschreibung für die Investition des 2. Jahres",null,null,null,null,null,"Berechnung Abschreibung für die Investition des 3. Jahres",null,null,null,null,null,"Berechnung Abschreibung für die Investition des 4. Jahres",null,null,null,null,null,"Berechnung Abschreibung für die Investition des 5. Jahres"]
["Descrizione","Tipo di investimento",null,null,null,null,null,null,null,null,null,null,null,null,null,"Investition",{"$f":"SUM(C4:C23)","v":0},{"$f":"SUM(D4:D23)+Q3","v":0},{"$f":"SUM(E4:E23)+R3","v":0},{"$f":"SUM(F4:F23)+S3","v":0},0,{"$f":"SUM(Q3:U3)","v":0}]
[null,1,null,null,null,null,null,{"$f":"SUMIF($B$46:$B$54,B4,$C$46:$C$54)","v":0},{"$f":"SUMIF($B$46:$B$54,B4,$D$46:$D$54)","v":0},{"$f":"AC4","v":0},{"$f":"SUM(AD4,AI4)","v":0},{"$f":"SUM(AE4,AJ4,AO4)","v":0},{"$f":"SUM(AF4,AK4,AP4,AU4)","v":0},{"$f":"SUM(AG4,AL4,AQ4,AV4,BA4)","v":0},null,"Abschreibung",{"$f":"SUM(J4:J23)","v":0},{"$f":"SUM(K4:K23)","v":0},{"$f":"SUM(L4:L23)","v":0},{"$f":"SUM(M4:M23)","v":0},0,{"$f":"SUM(Q4:U4)","v":0},null,null,null,null,null,null,{"$f":"C4*I4","v":0},{"$f":"IF(SUM($AC4:AC4)<$C4, AD27*$I4,\"\")","v":""},{"$f":"IF(SUM($AC4:AD4)<$C4, AE27*$I4,\"\")","v":""},{"$f":"IF(SUM($AC4:AE4)<$C4, AF27*$I4,\"\")","v":""},{"$f":"IF(SUM($AC4:AF4)<$C4, AG27*$I4,\"\")","v":""},null,{"$f":"IF(D4<=0,\"\",D4*I4)","v":""},{"$f":"IF(SUM($AI4:AI4)<$D4,AJ27*$I4,\"\")","v":""},{"$f":"IF(SUM($AI4:AJ4)<$D4,AK27*$I4,\"\")","v":""},{"$f":"IF(SUM($AI4:AK4)<$D4,AL27*$I4,\"\")","v":""},{"$f":"IF(SUM($AI4:AL4)<$D4,AM27*$I4,\"\")","v":""},null,{"$f":"IF(E4<=0,\"\",E4*I4)","v":""},{"$f":"IF(SUM($AO4:AO4)<$E4,AP27*$I4,\"\")","v":""},{"$f":"IF(SUM($AO4:AP4)<$E4,AQ27*$I4,\"\")","v":""},{"$f":"IF(SUM($AO4:AQ4)<$E4,AR27*$I4,\"\")","v":""},{"$f":"IF(SUM($AO4:AR4)<$E4,AS27*$I4,\"\")","v":""},null,{"$f":"IF(F4<=0,\"\",F4*I4)","v":""},{"$f":"IF(SUM($AU4:AU4)<$F4,AV27*$I4,\"\")","v":""},{"$f":"IF(SUM($AU4:AV4)<$F4,AW27*$I4,\"\")","v":""},{"$f":"IF(SUM($AU4:AW4)<$F4,AX27*$I4,\"\")","v":""},{"$f":"IF(SUM($AU4:AX4)<$F4,AY27*$I4,\"\")","v":""},null,{"$f":"IF(G4<=0,\"\",G4*I4)","v":""},{"$f":"IF(SUM($BA4:BA4)<$G4,$G4*$I4,\"\")","v":""},{"$f":"IF(SUM($BA4:BB4)<$G4,$G4*$I4,\"\")","v":""},{"$f":"IF(SUM($BA4:BC4)<$G4,$G4*$I4,\"\")","v":""},{"$f":"IF(SUM($BA4:BD4)<$G4,$G4*$I4,\"\")","v":""}]
[null,1,null,null,null,null,null,{"$f":"SUMIF($B$46:$B$54,B5,$C$46:$C$54)","v":0},{"$f":"SUMIF($B$46:$B$54,B5,$D$46:$D$54)","v":0},{"$f":"AC5","v":0},{"$f":"SUM(AD5,AI5)","v":0},{"$f":"SUM(AE5,AJ5,AO5)","v":0},{"$f":"SUM(AF5,AK5,AP5,AU5)","v":0},{"$f":"SUM(AG5,AL5,AQ5,AV5,BA5)","v":0},null,"%",{"$f":"IFERROR(Q4/Q3,\"\")","v":""},{"$f":"IFERROR(R4/R3,\"\")","v":""},"","","",{"$f":"SUM(Q5:U5)/COUNT(Q5:U5)","v":{"$error":"#DIV/0!"}},null,null,null,null,null,null,{"$f":"C5*I5","v":0},{"$f":"IF(SUM($AC5:AC5)<$C5, AD28*$I5,\"\")","v":""},{"$f":"IF(SUM($AC5:AD5)<$C5, AE28*$I5,\"\")","v":""},{"$f":"IF(SUM($AC5:AE5)<$C5, AF28*$I5,\"\")","v":""},{"$f":"IF(SUM($AC5:AF5)<$C5, AG28*$I5,\"\")","v":""},null,{"$f":"IF(D5<=0,\"\",D5*I5)","v":""},{"$f":"IF(SUM($AI5:AI5)<$D5,AJ28*$I5,\"\")","v":""},{"$f":"IF(SUM($AI5:AJ5)<$D5,AK28*$I5,\"\")","v":""},{"$f":"IF(SUM($AI5:AK5)<$D5,AL28*$I5,\"\")","v":""},{"$f":"IF(SUM($AI5:AL5)<$D5,AM28*$I5,\"\")","v":""},null,{"$f":"IF(E5<=0,\"\",E5*I5)","v":""},{"$f":"IF(SUM($AO5:AO5)<$E5,AP28*$I5,\"\")","v":""},{"$f":"IF(SUM($AO5:AP5)<$E5,AQ28*$I5,\"\")","v":""},{"$f":"IF(SUM($AO5:AQ5)<$E5,AR28*$I5,\"\")","v":""},{"$f":"IF(SUM($AO5:AR5)<$E5,AS28*$I5,\"\")","v":""},null,{"$f":"IF(F5<=0,\"\",F5*I5)","v":""},{"$f":"IF(SUM($AU5:AU5)<$F5,AV28*$I5,\"\")","v":""},{"$f":"IF(SUM($AU5:AV5)<$F5,AW28*$I5,\"\")","v":""},{"$f":"IF(SUM($AU5:AW5)<$F5,AX28*$I5,\"\")","v":""},{"$f":"IF(SUM($AU5:AX5)<$F5,AY28*$I5,\"\")","v":""},null,{"$f":"IF(G5<=0,\"\",G5*I5)","v":""},{"$f":"IF(SUM($BA5:BA5)<$G5,$G5*$I5,\"\")","v":""},{"$f":"IF(SUM($BA5:BB5)<$G5,$G5*$I5,\"\")","v":""},{"$f":"IF(SUM($BA5:BC5)<$G5,$G5*$I5,\"\")","v":""},{"$f":"IF(SUM($BA5:BD5)<$G5,$G5*$I5,\"\")","v":""}]
[null,1,null,null,null,null,null,0,0,0,0,0,0,0,null,null,null,null,null,null,null,null,null,null,null,null,null,null,0,{"$f":"IF(SUM($AC6:AC6)<$C6, AD29*$I6,\"\")","v":""},{"$f":"IF(SUM($AC6:AD6)<$C6, AE29*$I6,\"\")","v":""},{"$f":"IF(SUM($AC6:AE6)<$C6, AF29*$I6,\"\")","v":""},{"$f":"IF(SUM($AC6:AF6)<$C6, AG29*$I6,\"\")","v":""},null,"",{"$f":"IF(SUM($AI6:AI6)<$D6,AJ29*$I6,\"\")","v":""},{"$f":"IF(SUM($AI6:AJ6)<$D6,AK29*$I6,\"\")","v":""},{"$f":"IF(SUM($AI6:AK6)<$D6,AL29*$I6,\"\")","v":""},{"$f":"IF(SUM($AI6:AL6)<$D6,AM29*$I6,\"\")","v":""},null,"",{"$f":"IF(SUM($AO6:AO6)<$E6,AP29*$I6,\"\")","v":""},{"$f":"IF(SUM($AO6:AP6)<$E6,AQ29*$I6,\"\")","v":""},{"$f":"IF(SUM($AO6:AQ6)<$E6,AR29*$I6,\"\")","v":""},{"$f":"IF(SUM($AO6:AR6)<$E6,AS29*$I6,\"\")","v":""},null,"",{"$f":"IF(SUM($AU6:AU6)<$F6,AV29*$I6,\"\")","v":""},{"$f":"IF(SUM($AU6:AV6)<$F6,AW29*$I6,\"\")","v":""},{"$f":"IF(SUM($AU6:AW6)<$F6,AX29*$I6,\"\")","v":""},{"$f":"IF(SUM($AU6:AX6)<$F6,AY29*$I6,\"\")","v":""},null,"",{"$f":"IF(SUM($BA6:BA6)<$G6,$G6*$I6,\"\")","v":""},{"$f":"IF(SUM($BA6:BB6)<$G6,$G6*$I6,\"\")","v":""},{"$f":"IF(SUM($BA6:BC6)<$G6,$G6*$I6,\"\")","v":""},{"$f":"IF(SUM($BA6:BD6)<$G6,$G6*$I6,\"\")","v":""}]
{"$rows_left_out":49}
{"sheet":"4. Pianificazione del fatturato","index":5,"n_rows":100,"n_cols":8,"rows_kept":100,"cut":false,"hidden":false,"merged":[[41,0,41,7],[42,6,42,7],[42,1,42,2],[62,1,62,2],[61,0,61,7],[62,6,62,7],[62,4,62,5],[82,1,82,2],[82,4,82,5],[82,6,82,7],[81,0,81,7],[42,4,42,5],[0,0,0,7],[2,1,2,2],[2,4,2,5],[2,6,2,7],[22,6,22,7],[21,0,21,7],[1,0,1,7],[22,4,22,5],[22,1,22,2]]}
["Pianificazione del fatturato: 1° esercizio"]
["I dati relativi alla pianificazione del fatturato saranno trasferiti automaticamente nella tabella \"6. Conto economico annuo\"."]
[null,"Prodotto",null,"Fatturato","Impiego di merci",null,"Ricavi lordi "]
[null,"Prezzo / €","Quantità/anno",null,"in % ","Valore","in % ","Valore"]
["Prodotti / servizi",null,null,{"$f":"B5*C5","v":0},null,{"$f":"D5*E5","v":0},{"$f":"IF(B5=0,0,1-E5)","v":0},{"$f":"D5-F5","v":0}]
["Prodotti / servizi",null,null,0,null,0,0,0]
{"$rows_left_out":95}
{"sheet":"5. Costi del personale","index":6,"n_rows":69,"n_cols":11,"rows_kept":69,"cut":false,"hidden":false,"merged":[[0,2,0,3],[18,0,18,4],[44,0,44,4],[57,0,57,4],[3,0,3,4],[5,0,5,4],[31,0,31,4],[4,0,4,4]]}
["Settore",null,"Inizio mese",null,null,null,null,"gennaio",12,{"$f":"INDEX(I1:I12,K1)","v":12},1]
[null,{"$f":"J15","v":14},null,null,{"$f":"J1","v":12},null,null,"febbraio",11]
[null,null,null,null,null,null,null,"marzo",10]
["Costi del personale",null,null,null,null,null,null,"aprile",9]
["I costi del personale saranno trasferiti automaticamente nella tabella \"6. Conto economico annuo\".",null,null,null,null,null,null,"maggio",8]
["Anno 1",null,null,null,null,null,null,"giugno",7]
{"$rows_left_out":64}
{"sheet":"6. Conto economico annuo","index":7,"n_rows":2544,"n_cols":32,"rows_kept":2544,"cut":false,"hidden":false,"merged":[[156,16,156,17],[158,16,158,17],[160,16,160,17],[163,16,163,17],[145,16,145,17],[147,16,147,17],[149,16,149,17],[152,16,152,32],[154,18,154,19],[154,21,154,22],[154,24,154,25],[154,27,154,28],[154,30,154,31],[141,16,141,32],[142,16,142,17],[143,18,143,19],[143,21,143,22],[143,24,143,25],[143,27,143,28],[143,30,143,31],[129,16,129,17],[131,16,131,17],[133,16,133,17],[136,16,136,17],[139,16,139,32],[123,16,123,17],[125,16,125,32],[127,18,127,19],[127,21,127,22],[127,24,127,25],[127,27,127,28],[127,30,127,31],[112,25,112,26],[112,27,112,28],[112,29,112,30],[114,16,114,32],[116,18,116,19],[116,21,116,22],[116,24,116,25],[116,27,116,28],[116,30,116,31],[104,16,104,32],[106,19,106,28],[107,19,107,30],[108,19,108,22],[108,23,108,24],[108,25,108,26],[108,27,108,28],[108,29,108,30],[109,25,109,26],[109,27,109,28],[109,29,109,30],[110,25,110,26],[117,18,117,19],[117,21,117,22],[117,24,117,25],[117,27,117,28],[117,30,117,31],[118,18,118,19],[118,21,118,22],[118,24,118,25],[118,27,118,28],[118,30,118,31],[110,27,110,28],[110,29,110,30],[111,25,111,26],[111,27,111,28],[111,29,111,30],[55,8,55,9],[55,10,55,11],[54,10,54,11],[55,6,55,7],[2524,8,2525,8],[2524,9,2525,9],[127,0,128,2],[105,5,105,6],[105,2,105,3],[164,0,164,1],[105,8,105,9],[137,0,137,1],[62,0,62,1],[54,6,54,7],[50,0,50,1],[54,4,54,5],[58,0,58,1],[53,2,53,3],[54,2,54,3],[55,2,55,3],[55,4,55,5],[44,0,44,1],[46,0,46,1],[49,0,49,1],[23,0,23,1],[43,0,43,1],[38,0,38,1],[34,0,34,1],[28,0,28,1],[42,0,42,1],[36,0,36,1],[32,0,32,1],[48,0,48,1],[29,0,29,1],[39,0,39,1],[16,0,16,1],[18,0,18,1],[8,0,8,1],[6,0,6,1],[54,8,54,9],[0,0,0,11],[1,0,1,11],[2,0,2,1],[2,2,2,3],[2,4,2,5],[2,6,2,7],[2,10,2,11],[2,8,2,9],[15,0,15,1],[4,0,4,1],[13,0,13,1],[14,0,14,1],[19,0,19,1],[20,0,20,1],[25,0,25,1],[27,0,27,1],[22,0,22,1],[30,0,30,1],[24,0,24,1]]}
["Conto economico e calcolo della redditività (annuo)"]
["I valori \"fatturato\" e \"impiego di beni/merci\" vengono desunti dalla tabella \"4. Pianificazione del fatturato\"."]
["Descrizione",null,"Anno 1",null,"Anno 2",null,"Anno 3",null,"Anno 4",null,"Anno 5"]
[" - Fatturato",null,{"$f":"'4. Pianificazione del fatturato'!D20","v":0},1,{"$f":"'4. Pianificazione del fatturato'!D40","v":0},1,{"$f":"'4. Pianificazione del fatturato'!D60","v":0},1,{"$f":"'4. Pianificazione del fatturato'!D80","v":0},1,{"$f":"'4. Pianificazione del fatturato'!D100","v":0},1]
["-  Impiego di beni/merci ",null,{"$f":"'4. Pianificazione del fatturato'!F20","v":0},{"$f":"IF(C4=0,0,C5/C4)","v":0},{"$f":"'4. Pianificazione del fatturato'!F40","v":0},{"$f":"IF(E4=0,0,E5/E4)","v":0},{"$f":"'4. Pianificazione del fatturato'!F60","v":0},{"$f":"IF(G4=0,0,G5/G4)","v":0},{"$f":"'4. Pianificazione del fatturato'!F80","v":0},{"$f":"IF(I4=0,0,I5/I4)","v":0},{"$f":"'4. Pianificazione del fatturato'!F100","v":0},{"$f":"IF(K4=0,0,K5/K4)","v":0}]
["= Proventi lordi",null,{"$f":"C4-C5","v":0},{"$f":"D4-D5","v":1},0,1,0,1,0,1,0,1]
{"$rows_left_out":2539}
{"sheet":"7. Conto economico mensile","index":8,"n_rows":94,"n_cols":15,"rows_kept":94,"cut":false,"hidden":true,"merged":[[38,0,38,1],[17,0,17,1],[40,0,40,1],[34,0,34,1],[35,0,35,1],[36,0,36,1],[19,0,19,1],[24,0,24,1],[25,0,25,1],[26,0,26,1],[31,0,31,1],[21,0,21,1],[0,0,0,14],[2,0,2,1],[3,0,3,1],[4,0,4,1],[1,0,1,14],[5,0,5,1],[7,0,7,1],[18,0,18,1],[6,0,6,1],[9,0,9,1],[10,0,10,1],[11,0,11,1],[13,0,13,1],[14,0,14,1],[16,0,16,1],[15,0,15,1],[12,0,12,1],[8,0,8,1]]}
["Conto economico e calcolo della redditività (mensile)"]
["I valori \"fatturato, impiego di merci e costi variabili\" sono desunti dalla tabella \"6. Conto economico annuo\". I dati vengono ripartiti in percentuale sulle mensilità (riga 4)."]
["Descrizione",null,"Anno","Gennaio","Febbraio","Marzo","Aprile","Maggio","Giugno","Luglio","Agosto","Settembre","Ottobre","Novembre","Dicembre"]
["Quota percentuale per mese",null,{"$f":"SUM(D4:O4)","v":0},0,0,0,0,0,0,0,0,0,0,0]
["-  Fatturato",null,{"$f":"'6. Conto economico annuo'!C4","v":0},{"$f":"$C5*D4","v":0},{"$f":"$C5*E4","v":0},0,0,0,0,0,0,0,0,0,0]
["-  Impiego di merci",null,{"$f":"'6. Conto economico annuo'!C5","v":0},{"$f":"IF(D5=0,0,D4*'4. Pianificazione del fatturato'!$F$20)","v":0},{"$f":"IF(E5=0,0,E4*'4. Pianificazione del fatturato'!$F$20)","v":0},{"$f":"IF(F5=0,0,F4*'4. Pianificazione del fatturato'!$F$20)","v":0},{"$f":"IF(G5=0,0,G4*'4. Pianificazione del fatturato'!$F$20)","v":0},{"$f":"IF(H5=0,0,H4*'4. Pianificazione del fatturato'!$F$20)","v":0},{"$f":"IF(I5=0,0,I4*'4. Pianificazione del fatturato'!$F$20)","v":0},{"$f":"IF(J5=0,0,J4*'4. Pianificazione del fatturato'!$F$20)","v":0},{"$f":"IF(K5=0,0,K4*'4. Pianificazione del fatturato'!$F$20)","v":0},{"$f":"IF(L5=0,0,L4*'4. Pianificazione del fatturato'!$F$20)","v":0},{"$f":"IF(M5=0,0,M4*'4. Pianificazione del fatturato'!$F$20)","v":0},{"$f":"IF(N5=0,0,N4*'4. Pianificazione del fatturato'!$F$20)","v":0},{"$f":"IF(O5=0,0,O4*'4. Pianificazione del fatturato'!$F$20)","v":0}]
{"$rows_left_out":89}
{"sheet":"7. Piano di finanziamento","index":9,"n_rows":157,"n_cols":13,"rows_kept":157,"cut":false,"hidden":false,"merged":[[17,0,17,5],[6,0,6,5],[0,0,0,5],[2,0,2,3],[3,0,3,3],[4,0,4,3]]}
["Piano di finanziamento e fabbisogno di capitale"]
["Termini di pagamento:",null,null,null,"Valori individuali:"]
["Dopo quanti giorni vengono saldate in media le fatture emesse ai clienti? (in media)",null,null,null,null,"giorni"]
["Dopo quanti giorni saldo in media le fatture ricevute dai fornitori? (in media) ",null,null,null,null,"giorni"]
["Valore di magazzino in % rispetto al fatturato",null,null,null,null,"del fatturato"]
[null,"Anno 1","Anno 2","Anno 3","Anno 4","Anno 5"]
{"$rows_left_out":152}
{"sheet":"9. Piano d'ammortamento","index":10,"n_rows":34,"n_cols":21,"rows_kept":34,"cut":false,"hidden":true,"merged":[]}
["Piani d'ammortamento"]
[]
[null,"Mutuo          anno 1","Mutuo           anno 2","Mutuo \nanno 3","Mutuo           anno 4","Mutuo           anno 5","Somma        mutui",null,"Finanziamento anno 1","Finanziamento anno 2","Finanziamento anno 3","Finanziamento anno 4","Finanziamento anno 5","Somma finanziamenti soci",null,"Altri finanziamenti anno 1","Altri finanziamenti anno 2","Altri finanziamenti anno 3","Altri finanziamenti anno 4","Altri finanziamenti anno 5","Somma altri finanziamenti"]
["Totale",{"$f":"'7. Piano di finanziamento'!B38","v":0},{"$f":"'7. Piano di finanziamento'!C38","v":0},{"$f":"'7. Piano di finanziamento'!D38","v":0},{"$f":"'7. Piano di finanziamento'!E38","v":0},{"$f":"'7. Piano di finanziamento'!F38","v":0},null,null,{"$f":"'7. Piano di finanziamento'!B42","v":0},{"$f":"'7. Piano di finanziamento'!C42","v":0},{"$f":"'7. Piano di finanziamento'!D42","v":0},{"$f":"'7. Piano di finanziamento'!E42","v":0},{"$f":"'7. Piano di finanziamento'!F42","v":0},null,null,{"$f":"'7. Piano di finanziamento'!B46","v":0},{"$f":"'7. Piano di finanziamento'!C46","v":0},{"$f":"'7. Piano di finanziamento'!D46","v":0},{"$f":"'7. Piano di finanziamento'!E46","v":0},{"$f":"'7. Piano di finanziamento'!F46","v":0}]
["Durata",{"$f":"'7. Piano di finanziamento'!B39","v":0},{"$f":"'7. Piano di finanziamento'!C39","v":0},{"$f":"'7. Piano di finanziamento'!D39","v":0},{"$f":"'7. Piano di finanziamento'!E39","v":0},{"$f":"'7. Piano di finanziamento'!F39","v":0},null,null,{"$f":"'7. Piano di finanziamento'!B43","v":0},{"$f":"'7. Piano di finanziamento'!C43","v":0},{"$f":"'7. Piano di finanziamento'!D43","v":0},{"$f":"'7. Piano di finanziamento'!E43","v":0},{"$f":"'7. Piano di finanziamento'!F43","v":0},null,null,{"$f":"'7. Piano di finanziamento'!B47","v":0},{"$f":"'7. Piano di finanziamento'!C47","v":0},{"$f":"'7. Piano di finanziamento'!D47","v":0},{"$f":"'7. Piano di finanziamento'!E47","v":0},{"$f":"'7. Piano di finanziamento'!F47","v":0}]
["Tasso di interesse",{"$f":"'7. Piano di finanziamento'!B40","v":0},{"$f":"'7. Piano di finanziamento'!C40","v":0},{"$f":"'7. Piano di finanziamento'!D40","v":0},{"$f":"'7. Piano di finanziamento'!E40","v":0},{"$f":"'7. Piano di finanziamento'!F40","v":0},null,null,{"$f":"'7. Piano di finanziamento'!B44","v":0},{"$f":"'7. Piano di finanziamento'!C44","v":0},{"$f":"'7. Piano di finanziamento'!D44","v":0},{"$f":"'7. Piano di finanziamento'!E44","v":0},{"$f":"'7. Piano di finanziamento'!F44","v":0},null,null,{"$f":"'7. Piano di finanziamento'!B48","v":0},{"$f":"'7. Piano di finanziamento'!C48","v":0},{"$f":"'7. Piano di finanziamento'!D48","v":0},{"$f":"'7. Piano di finanziamento'!E48","v":0},{"$f":"'7. Piano di finanziamento'!F48","v":0}]
{"$rows_left_out":29}
{"sheet":"8. Riepilogo ammortamento","index":11,"n_rows":15,"n_cols":5,"rows_kept":15,"cut":false,"hidden":false,"merged":[[3,0,4,0],[1,30,1,31],[1,32,1,33],[1,34,1,35],[1,36,1,37],[1,38,1,39],[1,20,1,21],[1,22,1,23],[1,24,1,25],[1,26,1,27],[1,8,1,9],[1,0,1,4],[1,60,1,61],[1,62,1,63],[1,64,1,65],[1,40,1,41],[1,42,1,43],[1,44,1,45],[1,46,1,47],[1,28,1,29],[1,10,1,11],[1,12,1,13],[1,14,1,15],[1,16,1,17],[1,18,1,19],[1,108,1,109],[1,90,1,91],[1,92,1,93],[1,94,1,95],[1,96,1,97],[1,98,1,99],[1,48,1,49],[3,1,4,1],[3,2,4,2],[3,3,4,3],[3,4,4,4],[1,100,1,101],[1,80,1,81],[1,82,1,83],[1,84,1,85],[1,86,1,87],[1,66,1,67],[1,68,1,69],[1,50,1,51],[1,52,1,53],[1,54,1,55],[1,56,1,57],[1,58,1,59],[1,6,1,7],[1,88,1,89],[1,70,1,71],[1,72,1,73],[1,74,1,75],[1,76,1,77],[1,78,1,79],[1,102,1,103],[1,104,1,105],[1,106,1,107],[1,140,1,141],[1,142,1,143],[1,144,1,145],[1,146,1,147],[1,148,1,149],[1,130,1,131],[1,132,1,133],[1,134,1,135],[1,136,1,137],[1,138,1,139],[1,120,1,121],[1,122,1,123],[1,124,1,125],[1,126,1,127],[1,128,1,129],[1,110,1,111],[1,112,1,113],[1,114,1,115],[1,116,1,117],[1,118,1,119],[1,180,1,181],[1,182,1,183],[1,184,1,185],[1,186,1,187],[1,188,1,189],[1,170,1,171],[1,172,1,173],[1,174,1,175],[1,176,1,177],[1,178,1,179],[1,160,1,161],[1,162,1,163],[1,164,1,165],[1,166,1,167],[1,168,1,169],[1,150,1,151],[1,152,1,153],[1,154,1,155],[1,156,1,157],[1,158,1,159],[1,220,1,221],[1,222,1,223],[1,224,1,225],[1,226,1,227],[1,228,1,229],[1,210,1,211],[1,212,1,213],[1,214,1,215],[1,216,1,217],[1,218,1,219],[1,200,1,201],[1,202,1,203],[1,204,1,205],[1,206,1,207],[1,208,1,209],[1,190,1,191],[1,192,1,193],[1,194,1,195],[1,196,1,197],[1,198,1,199],[1,230,1,231],[1,232,1,233],[1,234,1,235],[1,236,1,237],[1,238,1,239],[1,250,1,251],[1,252,1,253],[1,254,1,255],[1,240,1,241],[1,242,1,243],[1,244,1,245],[1,246,1,247],[1,248,1,249]]}
[]
["Riepilogo piani d'ammortamento"]
[]
[null,"Assorbimento di capitale di terzi","Pagamenti in conto capitale","Pagamenti in conto interessi","Stato passivo finale (ammontare dei debiti)"]
[]
["Anno 1",{"$f":"'9. Piano d''ammortamento'!B4+'9. Piano d''ammortamento'!I4+'9. Piano d''ammortamento'!P4","v":0},{"$f":"SUM('9. Piano d''ammortamento'!G10,'9. Piano d''ammortamento'!N10,'9. Piano d''ammortamento'!U10)","v":0},{"$f":"SUM('9. Piano d''ammortamento'!G22,'9. Piano d''ammortamento'!N22,'9. Piano d''ammortamento'!U22)","v":0},{"$f":"B6-C6","v":0}]
{"$rows_left_out":10}
{"sheet":"To-do-list","index":12,"n_rows":22,"n_cols":6,"rows_kept":22,"cut":false,"hidden":false,"merged":[[0,0,0,1],[15,0,15,1]]}
["To-do-list"]
[null,null,"Chi?","Entro quando?","Urgenza","Importanza"]
["1."]
["2."]
["3."]
["4."]
{"$rows_left_out":17}
{"sheet":"Glossario","index":13,"n_rows":106,"n_cols":1,"rows_kept":106,"cut":false,"hidden":false,"merged":[]}
["Glossario"]
[]
["Ammortamento"]
["Gli ammortamenti esprimono numericamente la riduzione di valore di un bene economico nel corso del periodo contabile. Tale consumo di valore origina dall'uso (es. usura) e dallo scorrere del tempo (es. perdita di valore in conseguenza delle innovazioni tecnologiche). Esso interessa il capitale fisso come macchinari, immobili, parco vetture, computer etc. La quota annuale di ammortamento è stabilita dalle norme fiscali e da quelle che disciplinano le attività commerciali. Nel business plan l'ammortamento viene calcolato automaticamente in base alla quota di ammortamento fiscale e alla durata utile del bene."]
[]
["Acquisto di merci"]
{"$rows_left_out":100}